Update changelog for 2.30.6-1pureos1 release

5 jobs for pureos/byzantium in 112 minutes and 54 seconds (queued for 2 seconds)
Status Job ID Name Coverage
  Package
passed #337040
librem5
package:deb-debian-bullseye

01:52:54

failed #337041
librem5:arm64
package:deb-debian-bullseye:arm64

01:41:39

 
  Test Package
skipped #337042
librem5
autopkgtest-debian-bullseye-package
passed #337044
librem5
check-tarball

00:03:16

skipped #337043
librem5
lintian-debian-bullseye-package
 
Name Stage Failure
failed
package:deb-debian-bullseye:arm64 Package
                 from ../Source/WebKit/WebProcess/Automation/WebAutomationSessionProxy.cpp:40:
DerivedSources/ForwardingHeaders/JavaScriptCore/ARM64Assembler.h:371:14: note: because ‘JSC::ARM64Assembler::LinkRecord’ has user-provided ‘void JSC::ARM64Assembler::LinkRecord::operator=(const JSC::ARM64Assembler::LinkRecord&)’
371 | void operator=(const LinkRecord& other)
| ^~~~~~~~
ninja: build stopped: subcommand failed.
dh_auto_build: error: cd build && LC_ALL=C.UTF-8 ninja -j16 -v returned exit code 1
make: *** [debian/rules:96: binary] Error 25
dpkg-buildpackage: error: debian/rules binary subprocess returned exit status 2
ERROR: Job failed: exit code 1