Debian: build purple backend

5 jobs for ci_lintian in 1 minute and 54 seconds (queued for 15 seconds)
latest
Status Job ID Name Coverage
  Build
failed #243116
allowed to fail
build-folks

canceled #233211
allowed to fail
build-folks

 
  Package
failed #243109
librem5
package:deb-debian-buster

00:01:54

failed #233212
librem5
package:deb-debian-buster

00:01:29

 
  Test Package
skipped #233213
librem5
lintian-debian-buster-package
 
Name Stage Failure
failed
build-folks Build There has been a timeout failure or the job got stuck. Check your timeout limits or try again
No job log
failed
package:deb-debian-buster Package

dh_install: warning: libfolks-purple-dev missing files: usr/lib/*/pkgconfig/folks-purple.pc
dh_install: warning: Cannot find (any matches for) "usr/share/vala/vapi/folks-purple.*" (tried in ., debian/tmp)

dh_install: warning: libfolks-purple-dev missing files: usr/share/vala/vapi/folks-purple.*
dh_install: error: missing files, aborting
make: *** [debian/rules:12: binary] Error 25
dpkg-buildpackage: error: debian/rules binary subprocess returned exit status 2
ERROR: Job failed: exit code 1