Document changes and release 0.1.3pureos1

7 jobs for v0.1.3pureos1 in 9 minutes and 6 seconds (queued for 1 minute and 19 seconds)
latest
Status Job ID Name Coverage
  Build
passed #216991
librem5
build-with-xwayland-alpinelinux-edge

00:00:43

passed #216989
librem5
build-with-xwayland-debian-bullseye

00:02:30

passed #216988
librem5
build-with-xwayland-debian-buster

00:02:07

passed #216992
librem5
build-without-xwayland-alpinelinux-edge

00:00:45

passed #216990
librem5
build-without-xwayland-debian-buster

00:02:13

 
  Package
passed #216993
librem5
package-deb-with-wlroots

00:02:52

failed #216994
librem5
package-deb-without-wlroots

00:02:42

 
Name Stage Failure
failed
package-deb-without-wlroots Package
cc  -o src/phoc 'src/25a6634@@phoc@exe/settings.c.o' 'src/25a6634@@phoc@exe/cursor.c.o' 'src/25a6634@@phoc@exe/desktop.c.o' 'src/25a6634@@phoc@exe/ini.c.o' 'src/25a6634@@phoc@exe/input.c.o' 'src/25a6634@@phoc@exe/keyboard.c.o' 'src/25a6634@@phoc@exe/keybindings.c.o' 'src/25a6634@@phoc@exe/layer_shell.c.o' 'src/25a6634@@phoc@exe/main.c.o' 'src/25a6634@@phoc@exe/output.c.o' 'src/25a6634@@phoc@exe/phosh.c.o' 'src/25a6634@@phoc@exe/render.c.o' 'src/25a6634@@phoc@exe/seat.c.o' 'src/25a6634@@phoc@exe/server.c.o' 'src/25a6634@@phoc@exe/switch.c.o' 'src/25a6634@@phoc@exe/text_input.c.o' 'src/25a6634@@phoc@exe/view.c.o' 'src/25a6634@@phoc@exe/virtual_keyboard.c.o' 'src/25a6634@@phoc@exe/xdg_shell.c.o' 'src/25a6634@@phoc@exe/xdg_shell_v6.c.o' 'src/25a6634@@phoc@exe/xwayland.c.o' -Wl,--no-undefined -Wl,--as-needed -g -O2 -fdebug-prefix-map=/builds/Librem5/phoc=. -fstack-protector-strong -Wformat -Werror=format-security -Wl,-z,relro -Wl,--start-group subprojects/wlroots/libwlroots.a subprojects/wlroots/xwayland/libwlr_xwayland.a subprojects/wlroots/protocol/libwl_protos.a subprojects/wlroots/backend/libwlr_backend.a subprojects/wlroots/render/libwlr_render.a subprojects/wlroots/backend/x11/libwlr_backend_x11.a subprojects/wlroots/types/libwlr_types.a subprojects/wlroots/util/libwlr_util.a subprojects/wlroots/xcursor/libwlr_xcursor.a protocols/libserver_protos.a /usr/lib/x86_64-linux-gnu/libinput.so /usr/lib/x86_64-linux-gnu/libgio-2.0.so /usr/lib/x86_64-linux-gnu/libgobject-2.0.so /usr/lib/x86_64-linux-gnu/libglib-2.0.so /usr/lib/x86_64-linux-gnu/libgnome-desktop-3.so /usr/lib/x86_64-linux-gnu/libgtk-3.so /usr/lib/x86_64-linux-gnu/libgdk-3.so /usr/lib/x86_64-linux-gnu/libpangocairo-1.0.so /usr/lib/x86_64-linux-gnu/libpango-1.0.so /usr/lib/x86_64-linux-gnu/libatk-1.0.so /usr/lib/x86_64-linux-gnu/libcairo-gobject.so /usr/lib/x86_64-linux-gnu/libcairo.so /usr/lib/x86_64-linux-gnu/libgdk_pixbuf-2.0.so -lm /usr/lib/x86_64-linux-gnu/libpixman-1.so /usr/lib/x86_64-linux-gnu/libwayland-server.so /usr/lib/x86_64-linux-gnu/libcap.so /lib/x86_64-linux-gnu/libsystemd.so /usr/lib/x86_64-linux-gnu/libwayland-client.so /usr/lib/x86_64-linux-gnu/libwayland-egl.so /usr/lib/x86_64-linux-gnu/libEGL.so /usr/lib/x86_64-linux-gnu/libGLESv2.so /usr/lib/x86_64-linux-gnu/libdrm.so /usr/lib/x86_64-linux-gnu/libgbm.so /usr/lib/x86_64-linux-gnu/libxkbcommon.so /lib/x86_64-linux-gnu/libudev.so -lm -lm /usr/lib/x86_64-linux-gnu/libxcb.so /usr/lib/x86_64-linux-gnu/libxcb-composite.so /usr/lib/x86_64-linux-gnu/libxcb-render.so /usr/lib/x86_64-linux-gnu/libxcb-xfixes.so /usr/lib/x86_64-linux-gnu/libxcb-icccm.so /usr/lib/x86_64-linux-gnu/libX11-xcb.so /usr/lib/x86_64-linux-gnu/libX11.so /usr/lib/x86_64-linux-gnu/libxcb-xinput.so -lrt -Wl,--end-group '-Wl,-rpath,$ORIGIN/../subprojects/wlroots:$ORIGIN/../protocols' -Wl,-rpath-link,/builds/Librem5/phoc/obj-x86_64-linux-gnu/subprojects/wlroots:/builds/Librem5/phoc/obj-x86_64-linux-gnu/protocols  
/usr/bin/ld: src/25a6634@@phoc@exe/render.c.o: in function `scan_out_fullscreen_view':
./obj-x86_64-linux-gnu/../src/render.c:238: undefined reference to `wlr_output_attach_buffer'
collect2: error: ld returned 1 exit status
ninja: build stopped: subcommand failed.
dh_auto_build: cd obj-x86_64-linux-gnu && LC_ALL=C.UTF-8 ninja -j4 -v returned exit code 1
make: *** [debian/rules:6: build] Error 1
dpkg-buildpackage: error: debian/rules build subprocess returned exit status 2
ERROR: Job failed: exit code 1