Update patches

4 jobs for byz in 6 minutes and 43 seconds (queued for 2 seconds)
Status Job ID Name Coverage
  Package
failed #329100
librem5
package:deb-debian-bullseye

00:02:14

failed #329101
librem5:arm64
package:deb-debian-bullseye:arm64

00:06:09

 
  Test Package
skipped #329102
librem5
autopkgtest-debian-bullseye-package
skipped #329103
librem5
lintian-debian-bullseye-package
 
Name Stage Failure
failed
package:deb-debian-bullseye:arm64 Package
Ok:                 11  
Expected Fail: 0
Fail: 1
Unexpected Pass: 0
Skipped: 0
Timeout: 0
Running after_script
Uploading artifacts for failed job
ERROR: Job failed: exit code 1
failed
package:deb-debian-bullseye Package
Unexpected Pass:    0   
Skipped: 0
Timeout: 0
dh_auto_test: error: cd obj-x86_64-linux-gnu && LC_ALL=C.UTF-8 MESON_TESTTHREADS=4 meson test returned exit code 1
make[1]: *** [debian/rules:20: override_dh_auto_test] Error 25
make[1]: Leaving directory '/builds/alexander.mikhaylenko/epiphany'
make: *** [debian/rules:7: binary] Error 2
dpkg-buildpackage: error: debian/rules binary subprocess returned exit status 2
ERROR: Job failed: exit code 1