notifier: Add notification category

6 jobs for better-notifications in 4 minutes and 56 seconds (queued for 1 second)
Status Job ID Name Coverage
  Package
failed #361539
librem5
package-pureos-byzantium

00:01:38

canceled #361540
librem5:arm64
package-pureos-byzantium:arm64

00:04:23

 
  Test Package
skipped #361541
librem5
autopkgtest-pureos-byzantium-package
passed #361544
librem5
check-tarball

00:00:43

skipped #361542
librem5
lintian-pureos-byzantium-package
failed #361543
librem5
check-tarball

00:00:52

 
Name Stage Failure
failed
package-pureos-byzantium Package
[60/190] cc -Iplugins/mm/libmm.so.p -Iplugins/mm -I../plugins/mm -Isrc -I../src -I/usr/include/glib-2.0 -I/usr/lib/x86_64-linux-gnu/glib-2.0/include -I/usr/include/gtk-3.0 -I/usr/include/at-spi2-atk/2.0 -I/usr/include/at-spi-2.0 -I/usr/include/dbus-1.0 -I/usr/lib/x86_64-linux-gnu/dbus-1.0/include -I/usr/include/gio-unix-2.0 -I/usr/include/cairo -I/usr/include/pango-1.0 -I/usr/include/harfbuzz -I/usr/include/fribidi -I/usr/include/atk-1.0 -I/usr/include/pixman-1 -I/usr/include/uuid -I/usr/include/freetype2 -I/usr/include/libpng16 -I/usr/include/gdk-pixbuf-2.0 -I/usr/include/libmount -I/usr/include/blkid -I/usr/include/ModemManager -I/usr/include/libmm-glib -I/usr/include/libpeas-1.0 -I/usr/include/gobject-introspection-1.0 -fdiagnostics-color=always -pipe -D_FILE_OFFSET_BITS=64 -Wall -Winvalid-pch -std=gnu11 -Wcast-align -Wdate-time -Wdeclaration-after-statement -Werror=format-security -Werror=format=2 -Wendif-labels -Werror=incompatible-pointer-types -Werror=missing-declarations -Werror=overflow -Werror=return-type -Werror=shift-count-overflow -Werror=shift-overflow=2 -Wfloat-equal -Wformat-nonliteral -Wformat-security -Winit-self -Wmaybe-uninitialized -Wmissing-include-dirs -Wmissing-noreturn -Wnested-externs -Wold-style-definition -Wshadow -Wstrict-prototypes -Wswitch-default -Wno-switch-enum -Wtype-limits -Wunused-function -DGLIB_VERSION_MIN_REQUIRED=GLIB_VERSION_2_64 -DGLIB_VERSION_MAX_ALLOWED=GLIB_VERSION_2_68 -DEDS_DISABLE_DEPRECATED -g -O2 -ffile-prefix-map=/builds/guido.gunther/pkg-calls=. -fstack-protector-strong -Wformat -Werror=format-security -Wdate-time -D_FORTIFY_SOURCE=2 -fPIC -pthread -MD -MQ plugins/mm/libmm.so.p/calls-mm-origin.c.o -MF plugins/mm/libmm.so.p/calls-mm-origin.c.o.d -o plugins/mm/libmm.so.p/calls-mm-origin.c.o -c ../plugins/mm/calls-mm-origin.c
[61/190] cc -Iplugins/dummy/libdummy.so.p -Iplugins/dummy -I../plugins/dummy -Isrc -I../src -I/usr/include/glib-2.0 -I/usr/lib/x86_64-linux-gnu/glib-2.0/include -I/usr/include/gtk-3.0 -I/usr/include/at-spi2-atk/2.0 -I/usr/include/at-spi-2.0 -I/usr/include/dbus-1.0 -I/usr/lib/x86_64-linux-gnu/dbus-1.0/include -I/usr/include/gio-unix-2.0 -I/usr/include/cairo -I/usr/include/pango-1.0 -I/usr/include/harfbuzz -I/usr/include/fribidi -I/usr/include/atk-1.0 -I/usr/include/pixman-1 -I/usr/include/uuid -I/usr/include/freetype2 -I/usr/include/libpng16 -I/usr/include/gdk-pixbuf-2.0 -I/usr/include/libmount -I/usr/include/blkid -I/usr/include/libpeas-1.0 -I/usr/include/gobject-introspection-1.0 -fdiagnostics-color=always -pipe -D_FILE_OFFSET_BITS=64 -Wall -Winvalid-pch -std=gnu11 -Wcast-align -Wdate-time -Wdeclaration-after-statement -Werror=format-security -Werror=format=2 -Wendif-labels -Werror=incompatible-pointer-types -Werror=missing-declarations -Werror=overflow -Werror=return-type -Werror=shift-count-overflow -Werror=shift-overflow=2 -Wfloat-equal -Wformat-nonliteral -Wformat-security -Winit-self -Wmaybe-uninitialized -Wmissing-include-dirs -Wmissing-noreturn -Wnested-externs -Wold-style-definition -Wshadow -Wstrict-prototypes -Wswitch-default -Wno-switch-enum -Wtype-limits -Wunused-function -DGLIB_VERSION_MIN_REQUIRED=GLIB_VERSION_2_64 -DGLIB_VERSION_MAX_ALLOWED=GLIB_VERSION_2_68 -DEDS_DISABLE_DEPRECATED -g -O2 -ffile-prefix-map=/builds/guido.gunther/pkg-calls=. -fstack-protector-strong -Wformat -Werror=format-security -Wdate-time -D_FORTIFY_SOURCE=2 -fPIC -pthread -MD -MQ plugins/dummy/libdummy.so.p/calls-dummy-provider.c.o -MF plugins/dummy/libdummy.so.p/calls-dummy-provider.c.o.d -o plugins/dummy/libdummy.so.p/calls-dummy-provider.c.o -c ../plugins/dummy/calls-dummy-provider.c
ninja: build stopped: subcommand failed.
dh_auto_build: error: cd _build && LC_ALL=C.UTF-8 ninja -j4 -v returned exit code 1
make[1]: Leaving directory '/builds/guido.gunther/pkg-calls'
make[1]: *** [debian/rules:18: override_dh_auto_build] Error 25
make: *** [debian/rules:12: binary] Error 2
dpkg-buildpackage: error: debian/rules binary subprocess returned exit status 2
ERROR: Job failed: exit code 1