Document changes and release 0.3.0

14 jobs for v0.3.0 in 22 minutes and 53 seconds (queued for 3 seconds)
latest
Status Job ID Name Coverage
  Build
passed #266846
librem5
build:native-alpinelinux-edge

00:02:24

passed #266845
librem5
build:native-debian-bullseye

00:04:33

passed #266844
librem5
build:native-debian-buster

00:04:57

 
  Test
passed #266849
librem5
check-po

00:00:48

passed #266851
librem5
test:smoke:one-output

00:03:54

passed #266852
librem5
test:smoke:two-outputs

00:02:24

passed #266850
librem5
unit-test:native-alpinelinux-edge

00:03:47

passed #266848
librem5
unit-test:native-debian-bullseye

00:05:34

passed #266847
librem5
unit-test:native-debian-buster

00:05:24

14.6%
 
  Package
passed #266853
librem5
package:deb-debian-buster

00:03:32

passed #266854
librem5:arm64
package:deb-debian-buster:arm64

00:05:31

failed #266855
librem5
package:deb-pureos-amber

00:03:14

 
  Test Package
skipped #266856
librem5
autopkgtest-debian-buster-package
skipped #266857
librem5
lintian-debian-buster-package
 
Name Stage Failure
failed
package:deb-pureos-amber Package
Full log written to /builds/sebastian.krzyszkowiak/phosh/_build/meson-logs/testlog.txt
FAILED: meson-test
/usr/bin/meson test --no-rebuild --print-errorlogs
ninja: build stopped: subcommand failed.
make[1]: *** [debian/rules:13: override_dh_auto_test] Error 1
make[1]: Leaving directory '/builds/sebastian.krzyszkowiak/phosh'
make: *** [debian/rules:6: build] Error 2
dpkg-buildpackage: error: debian/rules build subprocess returned exit status 2
ERROR: Job failed: exit code 1