fr (French) added

4 jobs for patch-6 in 5 minutes and 13 seconds
latest
Status Job ID Name Coverage
  Build
failed #206636
librem5
build_deb

00:03:46

passed #206635
librem5
build_meson

00:03:17

 
  Test
failed #206638
librem5
test

00:01:54

skipped #206637
librem5
test_lintian
 
Name Stage Failure
failed
test Test
thread 'main' panicked at 'layout broken: MissingResource', src/libcore/result.rs:997:5
note: Run with `RUST_BACKTRACE=1` environment variable to display a backtrace.
-------

Full log written to /builds/uzanto/squeekboard/_build/meson-logs/testlog.txt
FAILED: meson-test
/usr/bin/meson test --no-rebuild --print-errorlogs
ninja: build stopped: subcommand failed.
ERROR: Job failed: exit code 1
failed
build_deb Build
Timeout:               0
dh_auto_test: cd _build && LC_ALL=C.UTF-8 MESON_TESTTHREADS=4 ninja test returned exit code 1
make[1]: *** [debian/rules:13: build-arch] Error 255
make[1]: Leaving directory '/builds/uzanto/squeekboard'
make: *** [debian/rules:7: build] Error 2
dpkg-buildpackage: error: debian/rules build subprocess returned exit status 2
debuild: fatal error at line 1182:
dpkg-buildpackage -us -uc -ui -i -b failed
ERROR: Job failed: exit code 1