fr (French) added

4 jobs for patch-7 in 3 minutes and 26 seconds (queued for 3 seconds)
latest
Status Job ID Name Coverage
  Build
failed #206640
librem5
build_deb

00:03:10

failed #206639
librem5
build_meson

00:02:45

 
  Test
skipped #206642
librem5
test
skipped #206641
librem5
test_lintian
 
Name Stage Failure
failed
build_deb Build
ninja: build stopped: subcommand failed.
dh_auto_build: cd _build && LC_ALL=C.UTF-8 ninja -j4 -v returned exit code 1
make[1]: *** [debian/rules:13: build-arch] Error 1
make[1]: Leaving directory '/builds/uzanto/squeekboard'
make: *** [debian/rules:7: build] Error 2
dpkg-buildpackage: error: debian/rules build subprocess returned exit status 2
debuild: fatal error at line 1182:
dpkg-buildpackage -us -uc -ui -i -b failed
ERROR: Job failed: exit code 1
failed
build_meson Build

error: Could not compile `rs`.

To learn more, run the command again with --verbose.
[58/62] Linking static target src/liblibsqueekboard.a.
FAILED: src/librs.a
/builds/uzanto/squeekboard/cargo.sh src/librs.a build
ninja: build stopped: subcommand failed.
ERROR: Job failed: exit code 1